Details

    • Type: Sub-task
    • Status: Open
    • Priority: Minor
    • Resolution: Unresolved
    • Component/s: viewer build
    • Labels:
      None
    • Environment:
      Ubuntu Linux 64 bit

      Description

      [ 37%] Building CXX object llmessage/CMakeFiles/INTEGRATION_TEST_llsdmessage.dir/llsdmessage.o
      Linking CXX executable ../sharedlibs/bin/INTEGRATION_TEST_llsdmessage
      LD_LIBRARY_PATH += ['/home/test/slsrc/snowglobe2/trunk/indra/sharedlibs/lib:/usr/lib']
      Running: /usr/bin/python2.5 /home/test/slsrc/snowglobe2/trunk/indra/llmessage/tests/test_llsdmessage_peer.py /home/test/slsrc/snowglobe2/trunk/indra/sharedlibs/bin/INTEGRATION_TEST_llsdmessage
      Failed to catch N11LLEventPump11DupPumpNameE
      Exception in thread httpd:
      Traceback (most recent call last):
      File "/usr/lib/python2.5/threading.py", line 486, in __bootstrap_inner
      self.run()
      File "/home/test/slsrc/snowglobe2/trunk/indra/llmessage/tests/test_llsdmessage_peer.py", line 124, in run
      httpd = HTTPServer(('127.0.0.1', 8000), TestHTTPRequestHandler)
      File "/usr/lib/python2.5/SocketServer.py", line 330, in _init_
      self.server_bind()
      File "/usr/lib/python2.5/BaseHTTPServer.py", line 101, in server_bind
      SocketServer.TCPServer.server_bind(self)
      File "/usr/lib/python2.5/SocketServer.py", line 341, in server_bind
      self.socket.bind(self.server_address)
      File "<string>", line 1, in bind
      error: (98, 'Address already in use')

      [llsdmessage, 3] fail: 'success response'
      Total Tests: 3
      Passed Tests: 2
      *********************************
      Failed Tests: 1
      Please report or fix the problem.
      *********************************
      Failure running: /usr/bin/python2.5 /home/test/slsrc/snowglobe2/trunk/indra/llmessage/tests/test_llsdmessage_peer.py /home/test/slsrc/snowglobe2/trunk/indra/sharedlibs/bin/INTEGRATION_TEST_llsdmessage
      Error: 1
      make[2]: *** [sharedlibs/bin/INTEGRATION_TEST_llsdmessage] Error 1
      make[1]: *** [llmessage/CMakeFiles/INTEGRATION_TEST_llsdmessage.dir/all] Error 2
      make: *** [all] Error 2

        Attachments

          Activity

            People

            Assignee:
            Unassigned Unassigned
            Reporter:
            zak.renfew Zak Renfew
            Watchers:
            1 Start watching this issue

              Dates

              Created:
              Updated:

                PagerDuty